Formamide, N-methyl-, conjugate base

Reaction thermochemistry data

Data compiled by: Michael M. Meot-Ner (Mautner) and Sharon G. Lias

Individual Reactions

C2H4NO- + Formamide, N-methyl- = (C2H4NO- • Formamide, N-methyl-)

By formula: C2H4NO- + C2H5NO = (C2H4NO- • C2H5NO)

Quantity Value Units Method Reference Comment
Δr120. ± 8.kJ/molPHPMSMeot-Ner (Mautner), 1988gas phase
Quantity Value Units Method Reference Comment
Δr130.J/mol*KPHPMSMeot-Ner (Mautner), 1988gas phase

Ion clustering data

Data compiled by: Michael M. Meot-Ner (Mautner) and Sharon G. Lias

Clustering reactions

C2H4NO- + Formamide, N-methyl- = (C2H4NO- • Formamide, N-methyl-)

By formula: C2H4NO- + C2H5NO = (C2H4NO- • C2H5NO)

Quantity Value Units Method Reference Comment
Δr120. ± 8.kJ/molPHPMSMeot-Ner (Mautner), 1988gas phase
Quantity Value Units Method Reference Comment
Δr130.J/mol*KPHPMSMeot-Ner (Mautner), 1988gas phase

References

Meot-Ner (Mautner), 1988
Meot-Ner (Mautner), M., Models for Strong Interactions in Proteins and Enzymes. 2. Interactions of Ions with the Peptide Link and Imidazole, J. Am. Chem. Soc., 1988, 110, 10, 3075, https://doi.org/10.1021/ja00218a014 . [all data]