Ethanol, 2,2,2-trifluoro-, protonated

Reaction thermochemistry data

Data compiled by: Michael M. Meot-Ner (Mautner) and Sharon G. Lias

Individual Reactions

C2H4F3O+ + Water = (C2H4F3O+ • Water)

By formula: C2H4F3O+ + H2O = (C2H4F3O+ • H2O)

Bond type: Hydrogen bond (positive ion to hydride)

Quantity Value Units Method Reference Comment
Δr128.kJ/molICRLarson and McMahon, 1982gas phase; switching reaction(H3O+)H2O, Entropy change calculated or estimated; Cunningham, Payzant, et al., 1972, Lias, Liebman, et al., 1984, Keesee and Castleman, 1986
Quantity Value Units Method Reference Comment
Δr99.6J/mol*KN/ALarson and McMahon, 1982gas phase; switching reaction(H3O+)H2O, Entropy change calculated or estimated; Cunningham, Payzant, et al., 1972, Lias, Liebman, et al., 1984, Keesee and Castleman, 1986

Free energy of reaction

ΔrG° (kJ/mol) T (K) Method Reference Comment
97.9309.ICRLarson and McMahon, 1982gas phase; switching reaction(H3O+)H2O, Entropy change calculated or estimated; Cunningham, Payzant, et al., 1972, Lias, Liebman, et al., 1984, Keesee and Castleman, 1986

C2H4F3O+ + Ethanol, 2,2,2-trifluoro- = (C2H4F3O+ • Ethanol, 2,2,2-trifluoro-)

By formula: C2H4F3O+ + C2H3F3O = (C2H4F3O+ • C2H3F3O)

Bond type: Hydrogen bonds of the type OH-O between organics

Quantity Value Units Method Reference Comment
Δr133.kJ/molICRLarson and McMahon, 1982gas phase; switching reaction(H2O)2H+, Entropy change calculated or estimated; Cunningham, Payzant, et al., 1972, Lias, Liebman, et al., 1984, Keesee and Castleman, 1986
Quantity Value Units Method Reference Comment
Δr121.J/mol*KN/ALarson and McMahon, 1982gas phase; switching reaction(H2O)2H+, Entropy change calculated or estimated; Cunningham, Payzant, et al., 1972, Lias, Liebman, et al., 1984, Keesee and Castleman, 1986
Quantity Value Units Method Reference Comment
Δr97.1kJ/molICRLarson and McMahon, 1982gas phase; switching reaction(H2O)2H+, Entropy change calculated or estimated; Cunningham, Payzant, et al., 1972, Lias, Liebman, et al., 1984, Keesee and Castleman, 1986

Ion clustering data

Data compiled by: Michael M. Meot-Ner (Mautner) and Sharon G. Lias

Clustering reactions

C2H4F3O+ + Ethanol, 2,2,2-trifluoro- = (C2H4F3O+ • Ethanol, 2,2,2-trifluoro-)

By formula: C2H4F3O+ + C2H3F3O = (C2H4F3O+ • C2H3F3O)

Bond type: Hydrogen bonds of the type OH-O between organics

Quantity Value Units Method Reference Comment
Δr133.kJ/molICRLarson and McMahon, 1982gas phase; switching reaction(H2O)2H+, Entropy change calculated or estimated; Cunningham, Payzant, et al., 1972, Lias, Liebman, et al., 1984, Keesee and Castleman, 1986
Quantity Value Units Method Reference Comment
Δr121.J/mol*KN/ALarson and McMahon, 1982gas phase; switching reaction(H2O)2H+, Entropy change calculated or estimated; Cunningham, Payzant, et al., 1972, Lias, Liebman, et al., 1984, Keesee and Castleman, 1986
Quantity Value Units Method Reference Comment
Δr97.1kJ/molICRLarson and McMahon, 1982gas phase; switching reaction(H2O)2H+, Entropy change calculated or estimated; Cunningham, Payzant, et al., 1972, Lias, Liebman, et al., 1984, Keesee and Castleman, 1986

C2H4F3O+ + Water = (C2H4F3O+ • Water)

By formula: C2H4F3O+ + H2O = (C2H4F3O+ • H2O)

Bond type: Hydrogen bond (positive ion to hydride)

Quantity Value Units Method Reference Comment
Δr128.kJ/molICRLarson and McMahon, 1982gas phase; switching reaction(H3O+)H2O, Entropy change calculated or estimated; Cunningham, Payzant, et al., 1972, Lias, Liebman, et al., 1984, Keesee and Castleman, 1986
Quantity Value Units Method Reference Comment
Δr99.6J/mol*KN/ALarson and McMahon, 1982gas phase; switching reaction(H3O+)H2O, Entropy change calculated or estimated; Cunningham, Payzant, et al., 1972, Lias, Liebman, et al., 1984, Keesee and Castleman, 1986

Free energy of reaction

ΔrG° (kJ/mol) T (K) Method Reference Comment
97.9309.ICRLarson and McMahon, 1982gas phase; switching reaction(H3O+)H2O, Entropy change calculated or estimated; Cunningham, Payzant, et al., 1972, Lias, Liebman, et al., 1984, Keesee and Castleman, 1986

References

Larson and McMahon, 1982
Larson, J.W.; McMahon, T.B., Formation, Thermochemistry, and Relative Stabilities of Proton - Bound dimers of Oxygen n - Donor Bases from Ion Cyclotron Resonance Solvent - Exchange Equilibria Measurements, J. Am. Chem. Soc., 1982, 104, 23, 6255, https://doi.org/10.1021/ja00387a016 . [all data]

Cunningham, Payzant, et al., 1972
Cunningham, A.J.; Payzant, J.D.; Kebarle, P., A Kinetic Study of the Proton Hydrate H+(H2O)n Equilibria in the Gas Phase, J. Am. Chem. Soc., 1972, 94, 22, 7627, https://doi.org/10.1021/ja00777a003 . [all data]

Lias, Liebman, et al., 1984
Lias, S.G.; Liebman, J.F.; Levin, R.D., Evaluated gas phase basicities and proton affinities of molecules heats of formation of protonated molecules, J. Phys. Chem. Ref. Data, 1984, 13, 695. [all data]

Keesee and Castleman, 1986
Keesee, R.G.; Castleman, A.W., Jr., Thermochemical data on Ggs-phase ion-molecule association and clustering reactions, J. Phys. Chem. Ref. Data, 1986, 15, 1011. [all data]