Perylene, protonated

Ion clustering data

Data compiled by: Michael M. Meot-Ner (Mautner) and Sharon G. Lias

Clustering reactions

C20H13+ + Perylene = (C20H13+ • Perylene)

By formula: C20H13+ + C20H12 = (C20H13+ • C20H12)

Quantity Value Units Method Reference Comment
Δr79.9kJ/molPHPMSMeot-Ner (Mautner), 1980gas phase; Entropy change calculated or estimated
Quantity Value Units Method Reference Comment
Δr120.J/mol*KN/AMeot-Ner (Mautner), 1980gas phase; Entropy change calculated or estimated

Free energy of reaction

ΔrG° (kJ/mol) T (K) Method Reference Comment
30.424.PHPMSMeot-Ner (Mautner), 1980gas phase; Entropy change calculated or estimated

References

Meot-Ner (Mautner), 1980
Meot-Ner (Mautner), M., Dimer Cations of Polycyclic Aromatics: Experimental Bonding Energies and Resonance Stabilization, J. Phys. Chem., 1980, 84, 21, 2724, https://doi.org/10.1021/j100458a012 . [all data]