Chrysene, positive ion

Ion clustering data

Data compiled by: Michael M. Meot-Ner (Mautner) and Sharon G. Lias

Clustering reactions

C18H12+ + Chrysene = (C18H12+ • Chrysene)

By formula: C18H12+ + C18H12 = (C18H12+ • C18H12)

Bond type: Charge transfer bond (positive ion)

Quantity Value Units Method Reference Comment
Δr76.1kJ/molPHPMSMeot-Ner (Mautner), 1980gas phase; Entropy change calculated or estimated
Quantity Value Units Method Reference Comment
Δr120.J/mol*KN/AMeot-Ner (Mautner), 1980gas phase; Entropy change calculated or estimated

Free energy of reaction

ΔrG° (kJ/mol) T (K) Method Reference Comment
26.418.PHPMSMeot-Ner (Mautner), 1980gas phase; Entropy change calculated or estimated

References

Meot-Ner (Mautner), 1980
Meot-Ner (Mautner), M., Dimer Cations of Polycyclic Aromatics: Experimental Bonding Energies and Resonance Stabilization, J. Phys. Chem., 1980, 84, 21, 2724, https://doi.org/10.1021/j100458a012 . [all data]