2,6-Di-tert-butylpyridine, protonated

Reaction thermochemistry data

Data compiled by: Michael M. Meot-Ner (Mautner) and Sharon G. Lias

Individual Reactions

C13H22N+ + Pyridine, 2,6-bis(1,1-dimethylethyl)- = (C13H22N+ • Pyridine, 2,6-bis(1,1-dimethylethyl)-)

By formula: C13H22N+ + C13H21N = (C13H22N+ • C13H21N)

Quantity Value Units Method Reference Comment
Δr96.kJ/molPHPMSMeot-Ner M. and Sieck, 1983gas phase; (H), DG<, ΔrS>
Quantity Value Units Method Reference Comment
Δr250.J/mol*KPHPMSMeot-Ner M. and Sieck, 1983gas phase; (H), DG<, ΔrS>

Free energy of reaction

ΔrG° (kJ/mol) T (K) Method Reference Comment
19.313.PHPMSMeot-Ner M. and Sieck, 1983gas phase; (H), DG<, ΔrS>

C13H22N+ + Water = (C13H22N+ • Water)

By formula: C13H22N+ + H2O = (C13H22N+ • H2O)

Bond type: Hydrogen bonds with steric hindrance in positive ions

Quantity Value Units Method Reference Comment
Δr52.3kJ/molPHPMSMeot-Ner M. and Sieck, 1983gas phase
Quantity Value Units Method Reference Comment
Δr170.J/mol*KPHPMSMeot-Ner M. and Sieck, 1983gas phase

References

Meot-Ner M. and Sieck, 1983
Meot-Ner M.; Sieck, L.W., The Ionic Hydrogen Bond. 1. Sterically Hindered Bonds. Solvation and Clustering of Sterically Hindered Amines and Pyridines, J. Am. Chem. Soc., 1983, 105, 10, 2956, https://doi.org/10.1021/ja00348a005 . [all data]