1,12-Diaminododecane, protonated

Reaction thermochemistry data

Data compiled by: Michael M. Meot-Ner (Mautner) and Sharon G. Lias

Individual Reactions

C12H29N2+ + Water = (C12H29N2+ • Water)

By formula: C12H29N2+ + H2O = (C12H29N2+ • H2O)

Bond type: Hydrogen bond (positive ion to hydride)

Free energy of reaction

ΔrG° (kJ/mol) T (K) Method Reference Comment
21.293.ES/HPMSKlassen, Blades, et al., 1995gas phase

Ion clustering data

Data compiled by: Michael M. Meot-Ner (Mautner) and Sharon G. Lias

Clustering reactions

C12H29N2+ + Water = (C12H29N2+ • Water)

By formula: C12H29N2+ + H2O = (C12H29N2+ • H2O)

Bond type: Hydrogen bond (positive ion to hydride)

Free energy of reaction

ΔrG° (kJ/mol) T (K) Method Reference Comment
21.293.ES/HPMSKlassen, Blades, et al., 1995gas phase

References

Klassen, Blades, et al., 1995
Klassen, J.S.; Blades, A.T.; Kebarle, P., Determinations of Ion-Molecule Equilibria Involving Ions Produced by Electrospray. Hydration of Protonated Amines, Diamines, and Some Small Peptides, J. Phys. Chem., 1995, 99, 42, 15509, https://doi.org/10.1021/j100042a027 . [all data]