Tributylamine, protonated

Reaction thermochemistry data

Data compiled by: Michael M. Meot-Ner (Mautner) and Sharon G. Lias

Individual Reactions

C12H28N+ + Water = (C12H28N+ • Water)

By formula: C12H28N+ + H2O = (C12H28N+ • H2O)

Bond type: Hydrogen bond (positive ion to hydride)

Quantity Value Units Method Reference Comment
Δr56.9kJ/molPHPMSMeot-Ner M. and Sieck, 1983gas phase
Quantity Value Units Method Reference Comment
Δr152.J/mol*KPHPMSMeot-Ner M. and Sieck, 1983gas phase

C12H28N+ + Tributylamine = (C12H28N+ • Tributylamine)

By formula: C12H28N+ + C12H27N = (C12H28N+ • C12H27N)

Quantity Value Units Method Reference Comment
Δr102.kJ/molPHPMSMeot-Ner M. and Sieck, 1983gas phase
Quantity Value Units Method Reference Comment
Δr236.J/mol*KPHPMSMeot-Ner M. and Sieck, 1983gas phase

References

Meot-Ner M. and Sieck, 1983
Meot-Ner M.; Sieck, L.W., The Ionic Hydrogen Bond. 1. Sterically Hindered Bonds. Solvation and Clustering of Sterically Hindered Amines and Pyridines, J. Am. Chem. Soc., 1983, 105, 10, 2956, https://doi.org/10.1021/ja00348a005 . [all data]