Naphthalene, 1-methyl-, positive ion

Reaction thermochemistry data

Data compiled by: Michael M. Meot-Ner (Mautner) and Sharon G. Lias

Individual Reactions

C11H10+ + Benzonitrile = (C11H10+ • Benzonitrile)

By formula: C11H10+ + C7H5N = (C11H10+ • C7H5N)

Quantity Value Units Method Reference Comment
Δr61.5kJ/molPHPMSEl-Shall and Meot-Ner (Mautner), 1987gas phase; Entropy change calculated or estimated
Quantity Value Units Method Reference Comment
Δr110.J/mol*KN/AEl-Shall and Meot-Ner (Mautner), 1987gas phase; Entropy change calculated or estimated

Free energy of reaction

ΔrG° (kJ/mol) T (K) Method Reference Comment
29.301.PHPMSEl-Shall and Meot-Ner (Mautner), 1987gas phase; Entropy change calculated or estimated

C11H10+ + Acetonitrile = (C11H10+ • Acetonitrile)

By formula: C11H10+ + C2H3N = (C11H10+ • C2H3N)

Quantity Value Units Method Reference Comment
Δr47.3kJ/molPHPMSEl-Shall and Meot-Ner (Mautner), 1987gas phase; Entropy change calculated or estimated
Quantity Value Units Method Reference Comment
Δr92.J/mol*KN/AEl-Shall and Meot-Ner (Mautner), 1987gas phase; Entropy change calculated or estimated

Free energy of reaction

ΔrG° (kJ/mol) T (K) Method Reference Comment
19.303.PHPMSEl-Shall and Meot-Ner (Mautner), 1987gas phase; Entropy change calculated or estimated

C11H10+ + Mesitylene = (C11H10+ • Mesitylene)

By formula: C11H10+ + C9H12 = (C11H10+ • C9H12)

Bond type: Charge transfer bond (positive ion)

Quantity Value Units Method Reference Comment
Δr58.2kJ/molPHPMSEl-Shall and Meot-Ner (Mautner), 1987gas phase
Quantity Value Units Method Reference Comment
Δr124.J/mol*KPHPMSEl-Shall and Meot-Ner (Mautner), 1987gas phase

C11H10+ + Naphthalene, 1-methyl- = (C11H10+ • Naphthalene, 1-methyl-)

By formula: C11H10+ + C11H10 = (C11H10+ • C11H10)

Bond type: Charge transfer bond (positive ion)

Quantity Value Units Method Reference Comment
Δr78.7kJ/molPHPMSEl-Shall and Meot-Ner (Mautner), 1987gas phase
Quantity Value Units Method Reference Comment
Δr126.J/mol*KPHPMSEl-Shall and Meot-Ner (Mautner), 1987gas phase

C11H10+ + Benzene, nitro- = (C11H10+ • Benzene, nitro-)

By formula: C11H10+ + C6H5NO2 = (C11H10+ • C6H5NO2)

Bond type: Charge transfer bond (positive ion)

Quantity Value Units Method Reference Comment
Δr54.8kJ/molPHPMSEl-Shall and Meot-Ner (Mautner), 1987gas phase
Quantity Value Units Method Reference Comment
Δr110.J/mol*KPHPMSEl-Shall and Meot-Ner (Mautner), 1987gas phase

C11H10+ + Benzene = (C11H10+ • Benzene)

By formula: C11H10+ + C6H6 = (C11H10+ • C6H6)

Bond type: Charge transfer bond (positive ion)

Quantity Value Units Method Reference Comment
Δr38.kJ/molPHPMSEl-Shall and Meot-Ner (Mautner), 1987gas phase
Quantity Value Units Method Reference Comment
Δr100.J/mol*KPHPMSEl-Shall and Meot-Ner (Mautner), 1987gas phase

C11H10+ + Methane, nitro- = (C11H10+ • Methane, nitro-)

By formula: C11H10+ + CH3NO2 = (C11H10+ • CH3NO2)

Quantity Value Units Method Reference Comment
Δr46.9kJ/molPHPMSEl-Shall and Meot-Ner (Mautner), 1987gas phase
Quantity Value Units Method Reference Comment
Δr93.3J/mol*KPHPMSEl-Shall and Meot-Ner (Mautner), 1987gas phase

Ion clustering data

Data compiled by: Michael M. Meot-Ner (Mautner) and Sharon G. Lias

Clustering reactions

C11H10+ + Methane, nitro- = (C11H10+ • Methane, nitro-)

By formula: C11H10+ + CH3NO2 = (C11H10+ • CH3NO2)

Quantity Value Units Method Reference Comment
Δr46.9kJ/molPHPMSEl-Shall and Meot-Ner (Mautner), 1987gas phase
Quantity Value Units Method Reference Comment
Δr93.3J/mol*KPHPMSEl-Shall and Meot-Ner (Mautner), 1987gas phase

C11H10+ + Acetonitrile = (C11H10+ • Acetonitrile)

By formula: C11H10+ + C2H3N = (C11H10+ • C2H3N)

Quantity Value Units Method Reference Comment
Δr47.3kJ/molPHPMSEl-Shall and Meot-Ner (Mautner), 1987gas phase; Entropy change calculated or estimated
Quantity Value Units Method Reference Comment
Δr92.J/mol*KN/AEl-Shall and Meot-Ner (Mautner), 1987gas phase; Entropy change calculated or estimated

Free energy of reaction

ΔrG° (kJ/mol) T (K) Method Reference Comment
19.303.PHPMSEl-Shall and Meot-Ner (Mautner), 1987gas phase; Entropy change calculated or estimated

C11H10+ + Benzene, nitro- = (C11H10+ • Benzene, nitro-)

By formula: C11H10+ + C6H5NO2 = (C11H10+ • C6H5NO2)

Bond type: Charge transfer bond (positive ion)

Quantity Value Units Method Reference Comment
Δr54.8kJ/molPHPMSEl-Shall and Meot-Ner (Mautner), 1987gas phase
Quantity Value Units Method Reference Comment
Δr110.J/mol*KPHPMSEl-Shall and Meot-Ner (Mautner), 1987gas phase

C11H10+ + Benzene = (C11H10+ • Benzene)

By formula: C11H10+ + C6H6 = (C11H10+ • C6H6)

Bond type: Charge transfer bond (positive ion)

Quantity Value Units Method Reference Comment
Δr38.kJ/molPHPMSEl-Shall and Meot-Ner (Mautner), 1987gas phase
Quantity Value Units Method Reference Comment
Δr100.J/mol*KPHPMSEl-Shall and Meot-Ner (Mautner), 1987gas phase

C11H10+ + Benzonitrile = (C11H10+ • Benzonitrile)

By formula: C11H10+ + C7H5N = (C11H10+ • C7H5N)

Quantity Value Units Method Reference Comment
Δr61.5kJ/molPHPMSEl-Shall and Meot-Ner (Mautner), 1987gas phase; Entropy change calculated or estimated
Quantity Value Units Method Reference Comment
Δr110.J/mol*KN/AEl-Shall and Meot-Ner (Mautner), 1987gas phase; Entropy change calculated or estimated

Free energy of reaction

ΔrG° (kJ/mol) T (K) Method Reference Comment
29.301.PHPMSEl-Shall and Meot-Ner (Mautner), 1987gas phase; Entropy change calculated or estimated

C11H10+ + Mesitylene = (C11H10+ • Mesitylene)

By formula: C11H10+ + C9H12 = (C11H10+ • C9H12)

Bond type: Charge transfer bond (positive ion)

Quantity Value Units Method Reference Comment
Δr58.2kJ/molPHPMSEl-Shall and Meot-Ner (Mautner), 1987gas phase
Quantity Value Units Method Reference Comment
Δr124.J/mol*KPHPMSEl-Shall and Meot-Ner (Mautner), 1987gas phase

C11H10+ + Naphthalene, 1-methyl- = (C11H10+ • Naphthalene, 1-methyl-)

By formula: C11H10+ + C11H10 = (C11H10+ • C11H10)

Bond type: Charge transfer bond (positive ion)

Quantity Value Units Method Reference Comment
Δr78.7kJ/molPHPMSEl-Shall and Meot-Ner (Mautner), 1987gas phase
Quantity Value Units Method Reference Comment
Δr126.J/mol*KPHPMSEl-Shall and Meot-Ner (Mautner), 1987gas phase

References

El-Shall and Meot-Ner (Mautner), 1987
El-Shall, M.S.; Meot-Ner (Mautner), M., Ionic Charge Transfer Complexes. 3. Delocalised pi Systems as Electron Acceptors and Donors, J. Phys. Chem., 1987, 91, 5, 1088, https://doi.org/10.1021/j100289a017 . [all data]