Azulene, positive ion

Ion clustering data

Data compiled by: Michael M. Meot-Ner (Mautner) and Sharon G. Lias

Clustering reactions

C10H8+ + Biphenylene = (C10H8+ • Biphenylene)

By formula: C10H8+ + C12H8 = (C10H8+ • C12H8)

Bond type: Charge transfer bond (positive ion)

Quantity Value Units Method Reference Comment
Δr15.9kcal/molPHPMSMeot-Ner (Mautner), 1980gas phase; Entropy change calculated or estimated
Quantity Value Units Method Reference Comment
Δr28.cal/mol*KN/AMeot-Ner (Mautner), 1980gas phase; Entropy change calculated or estimated

Free energy of reaction

ΔrG° (kcal/mol) T (K) Method Reference Comment
7.2309.PHPMSMeot-Ner (Mautner), 1980gas phase; Entropy change calculated or estimated

C10H8+ + Biphenyl = (C10H8+ • Biphenyl)

By formula: C10H8+ + C12H10 = (C10H8+ • C12H10)

Bond type: Charge transfer bond (positive ion)

Quantity Value Units Method Reference Comment
Δr13.5kcal/molPHPMSMeot-Ner (Mautner), 1980gas phase; Entropy change calculated or estimated
Quantity Value Units Method Reference Comment
Δr28.cal/mol*KN/AMeot-Ner (Mautner), 1980gas phase; Entropy change calculated or estimated

Free energy of reaction

ΔrG° (kcal/mol) T (K) Method Reference Comment
5.2297.PHPMSMeot-Ner (Mautner), 1980gas phase; Entropy change calculated or estimated

C10H8+ + Fluorene = (C10H8+ • Fluorene)

By formula: C10H8+ + C13H10 = (C10H8+ • C13H10)

Bond type: Charge transfer bond (positive ion)

Quantity Value Units Method Reference Comment
Δr14.6kcal/molPHPMSMeot-Ner (Mautner), 1980gas phase; Entropy change calculated or estimated
Quantity Value Units Method Reference Comment
Δr28.cal/mol*KN/AMeot-Ner (Mautner), 1980gas phase; Entropy change calculated or estimated

Free energy of reaction

ΔrG° (kcal/mol) T (K) Method Reference Comment
6.0307.PHPMSMeot-Ner (Mautner), 1980gas phase; Entropy change calculated or estimated

References

Meot-Ner (Mautner), 1980
Meot-Ner (Mautner), M., Dimer Cations of Polycyclic Aromatics: Experimental Bonding Energies and Resonance Stabilization, J. Phys. Chem., 1980, 84, 21, 2724, https://doi.org/10.1021/j100458a012 . [all data]