Naphthalene, positive ion

Reaction thermochemistry data

Data compiled by: Michael M. Meot-Ner (Mautner) and Sharon G. Lias

Individual Reactions

C10H8+ + Naphthalene = (C10H8+ • Naphthalene)

By formula: C10H8+ + C10H8 = (C10H8+ • C10H8)

Bond type: Charge transfer bond (positive ion)

Quantity Value Units Method Reference Comment
Δr74.5kJ/molPHPMSMeot-Ner (Mautner), 1980gas phase
Quantity Value Units Method Reference Comment
Δr120.J/mol*KPHPMSMeot-Ner (Mautner), 1980gas phase

Ion clustering data

Data compiled by: Michael M. Meot-Ner (Mautner) and Sharon G. Lias

Clustering reactions

C10H8+ + Naphthalene = (C10H8+ • Naphthalene)

By formula: C10H8+ + C10H8 = (C10H8+ • C10H8)

Bond type: Charge transfer bond (positive ion)

Quantity Value Units Method Reference Comment
Δr74.5kJ/molPHPMSMeot-Ner (Mautner), 1980gas phase
Quantity Value Units Method Reference Comment
Δr120.J/mol*KPHPMSMeot-Ner (Mautner), 1980gas phase

References

Meot-Ner (Mautner), 1980
Meot-Ner (Mautner), M., Dimer Cations of Polycyclic Aromatics: Experimental Bonding Energies and Resonance Stabilization, J. Phys. Chem., 1980, 84, 21, 2724, https://doi.org/10.1021/j100458a012 . [all data]