15-Crown-5 ether, protonated

Reaction thermochemistry data

Data compiled by: Michael M. Meot-Ner (Mautner) and Sharon G. Lias

Individual Reactions

C10H21O5+ + Water = (C10H21O5+ • Water)

By formula: C10H21O5+ + H2O = (C10H21O5+ • H2O)

Bond type: Hydrogen bonds with polydentate bonding in positive ions

Quantity Value Units Method Reference Comment
Δr90.4kJ/molPHPMSSharma and Kebarle, 1984gas phase
Quantity Value Units Method Reference Comment
Δr138.J/mol*KPHPMSSharma and Kebarle, 1984gas phase

C10H21O5+ + Methyl Alcohol = (C10H21O5+ • Methyl Alcohol)

By formula: C10H21O5+ + CH4O = (C10H21O5+ • CH4O)

Bond type: Hydrogen bonds with polydentate bonding in positive ions

Quantity Value Units Method Reference Comment
Δr83.7kJ/molPHPMSSharma and Kebarle, 1984gas phase
Quantity Value Units Method Reference Comment
Δr117.J/mol*KPHPMSSharma and Kebarle, 1984gas phase

References

Sharma and Kebarle, 1984
Sharma, R.B.; Kebarle, P., Stabilites and Hydrogen Bonding in Complexes of H3O+ and CH3OH2+ with Crown Ethers, from Measurements of Gas - Phase Ion - Molecule Equilibria, J. Am. Chem. Soc., 1984, 106, 14, 3913, https://doi.org/10.1021/ja00326a005 . [all data]