Dibenz[a,j]anthracene anion

Gas phase thermochemistry data

Data compiled by: John E. Bartmess

Quantity Value Units Method Reference Comment
Δfgas278. ± 4.2kJ/molR-EABecker and Chen, 1966

References

Becker and Chen, 1966
Becker, R.S.; Chen, E., Extension of Electron Affinities and Ionization Potentials of Aromatic Hydrocarbons, J. Chem. Phys., 1966, 45, 7, 2403, https://doi.org/10.1063/1.1727954 . [all data]