SiF4..p-benzoquinone radical anion

Gas phase thermochemistry data

Data compiled by: John E. Bartmess

Quantity Value Units Method Reference Comment
Δfgas-2018. ± 9.2kJ/molTherWilliamson, Knighton, et al., 2001at 150 C

Reaction thermochemistry data

Data compiled by: John E. Bartmess

Individual Reactions

p-Benzoquinone anion + Silicon tetrafluoride = C6H4F4O2Si-

By formula: C6H4O2- + F4Si = C6H4F4O2Si-

Quantity Value Units Method Reference Comment
Δr100. ± 8.4kJ/molTDAsWilliamson, Knighton, et al., 2001gas phase; at 150 C
Quantity Value Units Method Reference Comment
Δr55.2 ± 2.5kJ/molTDAsWilliamson, Knighton, et al., 2001gas phase; at 150 C

Ion clustering data

Data compiled by: John E. Bartmess

Clustering reactions

p-Benzoquinone anion + Silicon tetrafluoride = C6H4F4O2Si-

By formula: C6H4O2- + F4Si = C6H4F4O2Si-

Quantity Value Units Method Reference Comment
Δr100. ± 8.4kJ/molTDAsWilliamson, Knighton, et al., 2001gas phase; at 150 C
Quantity Value Units Method Reference Comment
Δr55.2 ± 2.5kJ/molTDAsWilliamson, Knighton, et al., 2001gas phase; at 150 C

References

Williamson, Knighton, et al., 2001
Williamson, D.H.; Knighton, W.B.; Grimsrud, E.P., Lewis acid-base interactions of SiF4 with molecular anions formed by electron capture reactions, Int. J. Mass Spectrom., 2001, 206, 1-2, 53-61, https://doi.org/10.1016/S1387-3806(00)00388-2 . [all data]