SiF4..oCF3-nitrobenzene radical anion

Reaction thermochemistry data

Data compiled by: John E. Bartmess

Individual Reactions

C7H4F3NO2- + Silicon tetrafluoride = C7H4F7NO2Si-

By formula: C7H4F3NO2- + F4Si = C7H4F7NO2Si-

Quantity Value Units Method Reference Comment
Δr10.60 ± 0.60kcal/molIMREWilliamson, Knighton, et al., 2001gas phase; at 150 C

References

Williamson, Knighton, et al., 2001
Williamson, D.H.; Knighton, W.B.; Grimsrud, E.P., Lewis acid-base interactions of SiF4 with molecular anions formed by electron capture reactions, Int. J. Mass Spectrom., 2001, 206, 1-2, 53-61, https://doi.org/10.1016/S1387-3806(00)00388-2 . [all data]