SiF4..3,5-diCF3-nitrobenzene radical anion
- Formula: C8H3F10NO2Si-
- Molecular weight: 363.1850

Reaction thermochemistry data

Data compiled by: John E. Bartmess
Individual Reactions
C8H3F6NO2- + = C8H3F10NO2Si-
By formula: C8H3F6NO2- + F4Si = C8H3F10NO2Si-
Quantity | Value | Units | Method | Reference | Comment |
---|---|---|---|---|---|
ΔrG° | 7.30 ± 0.60 | kcal/mol | IMRE | Williamson, Knighton, et al., 2001 | gas phase; at 150 C |

Ion clustering data

Data compiled by: John E. Bartmess
Clustering reactions
C8H3F6NO2- + = C8H3F10NO2Si-
By formula: C8H3F6NO2- + F4Si = C8H3F10NO2Si-
Quantity | Value | Units | Method | Reference | Comment |
---|---|---|---|---|---|
ΔrG° | 7.30 ± 0.60 | kcal/mol | IMRE | Williamson, Knighton, et al., 2001 | gas phase; at 150 C |

References

Williamson, Knighton, et al., 2001
Williamson, D.H.; Knighton, W.B.; Grimsrud, E.P.,
Lewis acid-base interactions of SiF4 with molecular anions formed by electron capture reactions,
Int. J. Mass Spectrom., 2001, 206, 1-2, 53-61, https://doi.org/10.1016/S1387-3806(00)00388-2
. [all data]