Benzo[a]pyrene anion

Gas phase thermochemistry data

Data compiled by: John E. Bartmess

Quantity Value Units Method Reference Comment
Δfgas50.2 ± 1.4kcal/molR-EACrocker, Wang, et al., 1993ΔGea(420 K) = -18.2 kcal/mol; ΔSea (estimated) = -1.5 eu (anthracene, Chowdhury, Heinis, et al., 1986)

References

Crocker, Wang, et al., 1993
Crocker, L.; Wang, T.B.; Kebarle, P., Electron Affinities of Some Polycyclic Aromatic Hydrocarbons, Obtained from Electron-Transfer Equilibria, J. Am. Chem. Soc., 1993, 115, 17, 7818, https://doi.org/10.1021/ja00070a030 . [all data]

Chowdhury, Heinis, et al., 1986
Chowdhury, S.; Heinis, T.; Grimsrud, E.P.; Kebarle, P., Entropy Changes and Electron Affinities from Gas-Phase Electron Transfer Equilibria: A- + B = A + B-, J. Phys. Chem., 1986, 90, 12, 2747, https://doi.org/10.1021/j100403a037 . [all data]