RhO anion

Gas phase ion energetics data

Data compiled by: John E. Bartmess

Electron affinity of neutral species

EAneutral (eV) Method Reference Comment
1.580 ± 0.020LPESLi and Wang, 1998

Gas phase thermochemistry data

Data compiled by: John E. Bartmess

Quantity Value Units Method Reference Comment
Δfgas250. ± 42.kJ/molR-EALi and Wang, 1998

References

Li and Wang, 1998
Li, X.; Wang, L.S., The chemical bonding and electronic structure of RhC, RhN, and RhO by anion photoelectron spectroscopy, J. Chem. Phys., 1998, 109, 13, 5264-5268, https://doi.org/10.1063/1.477143 . [all data]