MeOH..HCðC anion

Gas phase thermochemistry data

Data compiled by: John E. Bartmess

Quantity Value Units Method Reference Comment
Δfgas-9.6 ± 8.4kJ/molTherChabinyc and Brauman, 1999Anchored to MeOH ΔGacid=375.2

Reaction thermochemistry data

Data compiled by: John E. Bartmess

Individual Reactions

C2H- + Methyl Alcohol = C3H5O-

By formula: C2H- + CH4O = C3H5O-

Quantity Value Units Method Reference Comment
Δr90.4 ± 8.4kJ/molIMREChabinyc and Brauman, 1999gas phase; Anchored to MeOH ΔGacid=375.2
Quantity Value Units Method Reference Comment
Δr45.61kJ/molIMREMustanir, Matsuoka, et al., 2006gas phase
Δr48.5 ± 8.4kJ/molIMREChabinyc and Brauman, 1999gas phase; Anchored to MeOH ΔGacid=375.2

References

Chabinyc and Brauman, 1999
Chabinyc, M.L.; Brauman, J.I., Hydrogen bond strength and acidity. Structural and energetic correlations for acetylides and alcohols, J. Phys. Chem. A, 1999, 103, 46, 9163-9166, https://doi.org/10.1021/jp992852v . [all data]

Mustanir, Matsuoka, et al., 2006
Mustanir; Matsuoka, M.; Mishima, M.; Koch, H., Stability of complexes of phenylacetylides and benzyl alkoxides with methanol in the gas phase. Acid-base correlation in the ionic hydrogen-bond strength, Bull. Chem. Soc. Japan, 2006, 79, 7, 1118-1125, https://doi.org/10.1246/bcsj.79.1118 . [all data]