PhSi(Me)H anion

Reaction thermochemistry data

Data compiled by: John E. Bartmess

Individual Reactions

C7H9Si- + Hydrogen cation = Methylphenylsilane

By formula: C7H9Si- + H+ = C7H10Si

Quantity Value Units Method Reference Comment
Δr372.6 ± 2.1kcal/molG+TSWetzel, Salomon, et al., 1989gas phase; value altered from reference due to change in acidity scale
Quantity Value Units Method Reference Comment
Δr364.9 ± 2.0kcal/molIMREWetzel, Salomon, et al., 1989gas phase; value altered from reference due to change in acidity scale

References

Wetzel, Salomon, et al., 1989
Wetzel, D.M.; Salomon, K.E.; Berger, S.; Brauman, J.I., Gas-Phase Acidities of Organosilanes and Electron Affinities of Organosilyl Radicals, J. Am. Chem. Soc., 1989, 111, 11, 3835, https://doi.org/10.1021/ja00193a013 . [all data]