CH2=CHCHI anion

Reaction thermochemistry data

Data compiled by: John E. Bartmess

Individual Reactions

C3H4I- + Hydrogen cation = 1-Propene, 3-iodo-

By formula: C3H4I- + H+ = C3H5I

Quantity Value Units Method Reference Comment
Δr1551. ± 8.8kJ/molG+TSPoutsma, Nash, et al., 1997gas phase; Stronger than MeCN, near FCH2CH2OH
Quantity Value Units Method Reference Comment
Δr1520. ± 8.4kJ/molIMRBPoutsma, Nash, et al., 1997gas phase; Stronger than MeCN, near FCH2CH2OH

References

Poutsma, Nash, et al., 1997
Poutsma, J.C.; Nash, J.J.; Paulino, J.A.; Squires, R.R., Absolute Heats of Formation of Phenylcarbene and Vinylcarbene, J. Am. Chem. Soc., 1997, 119, 20, 4686, https://doi.org/10.1021/ja963918s . [all data]