MeOSS anion

Reaction thermochemistry data

Data compiled by: John E. Bartmess

Individual Reactions

CH3OS2- + Hydrogen cation = CH4OS2

By formula: CH3OS2- + H+ = CH4OS2

Quantity Value Units Method Reference Comment
Δr1467. ± 17.kJ/molG+TSSmith and O'Hair, 1997gas phase
Quantity Value Units Method Reference Comment
Δr1435. ± 17.kJ/molIMRBSmith and O'Hair, 1997gas phase

Gas phase ion energetics data

Data compiled by: John E. Bartmess

Protonation reactions

CH3OS2- + Hydrogen cation = CH4OS2

By formula: CH3OS2- + H+ = CH4OS2

Quantity Value Units Method Reference Comment
Δr1467. ± 17.kJ/molG+TSSmith and O'Hair, 1997gas phase
Quantity Value Units Method Reference Comment
Δr1435. ± 17.kJ/molIMRBSmith and O'Hair, 1997gas phase

References

Smith and O'Hair, 1997
Smith, J.D.; O'Hair, R.A.J., Gas Phase Reactions of Dialkoxysulfides. ROSSOR (R = CH3 and CH3CH2) with Anionic Nucleophiles, Phos. Sulf. Sili., 1997, 126, 1, 257, https://doi.org/10.1080/10426509708043565 . [all data]