cobalt oxide anion

Gas phase thermochemistry data

Data compiled by: John E. Bartmess

Quantity Value Units Method Reference Comment
Δfgas153. ± 13.kJ/molR-EALi and Wang, 1999

References

Li and Wang, 1999
Li, X.; Wang, L.-S., Electronic Structure and Chemical Bonding Between the First Row Transition Metals and C2: A Photoelectron Spectroscopy Study of MC2- (M=Sc, V, Cr, Mn, Fe, and Co), J. Chem. Phys., 1999, 111, 18, 8389, https://doi.org/10.1063/1.480218 . [all data]