Tl19 anion

Gas phase ion energetics data

Data compiled by: John E. Bartmess

Electron affinity of neutral species

EAneutral (eV) Method Reference Comment
2.15 ± 0.25LPESGausa, Ganteför, et al., 1990EA=E(threshold), or upper bound to EA.

References

Gausa, Ganteför, et al., 1990
Gausa, M.; Ganteför, G.; Lutz, H.O.; Meiwes-Broer, K.-H., Electronic Structure of Group III Heavy Element Clusters Studied by Photoelectron Spectroscopy, Int. J. Mass Spectrom. Ion Proc., 1990, 102, 227, https://doi.org/10.1016/0168-1176(90)80062-8 . [all data]