MeCðCCH2 anion

Reaction thermochemistry data

Data compiled by: John E. Bartmess

Individual Reactions

C4H5- + Hydrogen cation = 2-Butyne

By formula: C4H5- + H+ = C4H6

Quantity Value Units Method Reference Comment
Δr1628. ± 8.8kJ/molG+TSGal, Decouzon, et al., 2001gas phase; Acid: MeC≡CMe
Δr1628. ± 14.kJ/molG+TSN/Agas phase; Measured vs pyridine
Quantity Value Units Method Reference Comment
Δr1597. ± 8.4kJ/molIMREGal, Decouzon, et al., 2001gas phase; Acid: MeC≡CMe
Δr1596. ± 13.kJ/molIMREN/Agas phase; Measured vs pyridine

Gas phase ion energetics data

Data compiled by: John E. Bartmess

Protonation reactions

C4H5- + Hydrogen cation = 2-Butyne

By formula: C4H5- + H+ = C4H6

Quantity Value Units Method Reference Comment
Δr1628. ± 8.8kJ/molG+TSGal, Decouzon, et al., 2001gas phase; Acid: MeC≡CMe
Δr1628. ± 14.kJ/molG+TSN/Agas phase; Measured vs pyridine
Quantity Value Units Method Reference Comment
Δr1597. ± 8.4kJ/molIMREGal, Decouzon, et al., 2001gas phase; Acid: MeC≡CMe
Δr1596. ± 13.kJ/molIMREN/Agas phase; Measured vs pyridine

References

Gal, Decouzon, et al., 2001
Gal, J.F.; Decouzon, M.; Maria, P.C.; Gonzalez, A.I.; Mo, O.; Yanez, M.; El Chaouch, S.; Guillemin, J.C., Acidity trends in alpha,beta-unsaturated alkanes, silanes, germanes, and stannanes, J. Am. Chem. Soc., 2001, 123, 26, 6353-6359, https://doi.org/10.1021/ja004079j . [all data]