CH2=C=CMe anion

Reaction thermochemistry data

Data compiled by: John E. Bartmess

Individual Reactions

C4H5- + Hydrogen cation = 1,2-Butadiene

By formula: C4H5- + H+ = C4H6

Quantity Value Units Method Reference Comment
Δr1608. ± 8.8kJ/molG+TSN/Agas phase; Relative to dGacid(MeOH)= 375. Acid: MeCH=C=CH2
Quantity Value Units Method Reference Comment
Δr1574. ± 8.4kJ/molIMREN/Agas phase; Relative to dGacid(MeOH)= 375. Acid: MeCH=C=CH2

References

No reference data available.