(iPrOH)3..I anion

Reaction thermochemistry data

Data compiled by: John E. Bartmess

Individual Reactions

Iodide + 3Isopropyl Alcohol = C9H24IO3-

By formula: I- + 3C3H8O = C9H24IO3-

Quantity Value Units Method Reference Comment
Δr39.7 ± 2.9kJ/molTDAsBogdanov, Peschke, et al., 1999gas phase
Quantity Value Units Method Reference Comment
Δr14.8kJ/molTDAsBogdanov, Peschke, et al., 1999gas phase

Ion clustering data

Data compiled by: John E. Bartmess

Clustering reactions

Iodide + 3Isopropyl Alcohol = C9H24IO3-

By formula: I- + 3C3H8O = C9H24IO3-

Quantity Value Units Method Reference Comment
Δr39.7 ± 2.9kJ/molTDAsBogdanov, Peschke, et al., 1999gas phase
Quantity Value Units Method Reference Comment
Δr14.8kJ/molTDAsBogdanov, Peschke, et al., 1999gas phase

References

Bogdanov, Peschke, et al., 1999
Bogdanov, B.; Peschke, M.; Tonner, D.S.; Szulejko, J.E.; McMahon, T.B., Stepwise solvation of halides by alcohol molecules in the gas phase, Int. J. Mass Spectrom., 1999, 187, 707-725, https://doi.org/10.1016/S1387-3806(98)14180-5 . [all data]