(iPrOH)2..I anion

Reaction thermochemistry data

Data compiled by: John E. Bartmess

Individual Reactions

Iodide + 2Isopropyl Alcohol = C6H16IO2-

By formula: I- + 2C3H8O = C6H16IO2-

Quantity Value Units Method Reference Comment
Δr46.0 ± 1.3kJ/molTDAsBogdanov, Peschke, et al., 1999gas phase
Quantity Value Units Method Reference Comment
Δr19.5kJ/molTDAsBogdanov, Peschke, et al., 1999gas phase

Ion clustering data

Data compiled by: John E. Bartmess

Clustering reactions

Iodide + 2Isopropyl Alcohol = C6H16IO2-

By formula: I- + 2C3H8O = C6H16IO2-

Quantity Value Units Method Reference Comment
Δr46.0 ± 1.3kJ/molTDAsBogdanov, Peschke, et al., 1999gas phase
Quantity Value Units Method Reference Comment
Δr19.5kJ/molTDAsBogdanov, Peschke, et al., 1999gas phase

References

Bogdanov, Peschke, et al., 1999
Bogdanov, B.; Peschke, M.; Tonner, D.S.; Szulejko, J.E.; McMahon, T.B., Stepwise solvation of halides by alcohol molecules in the gas phase, Int. J. Mass Spectrom., 1999, 187, 707-725, https://doi.org/10.1016/S1387-3806(98)14180-5 . [all data]