Chrysene anion

Gas phase thermochemistry data

Data compiled by: John E. Bartmess

Quantity Value Units Method Reference Comment
Δfgas56.8 ± 1.1kcal/molR-EATschurl and Boesl, 2006

References

Tschurl and Boesl, 2006
Tschurl, M.; Boesl, U., Photodetachment-photoelectron spectroscopy of jet-cooled chrysene, Int. J. Mass Spectrom., 2006, 249, 364-369, https://doi.org/10.1016/j.ijms.2005.11.024 . [all data]