(tBuOH)2..Br anion

Reaction thermochemistry data

Data compiled by: John E. Bartmess

Individual Reactions

Bromine anion + 22-Propanol, 2-methyl- = C8H20BrO2-

By formula: Br- + 2C4H10O = C8H20BrO2-

Quantity Value Units Method Reference Comment
Δr12.90 ± 0.40kcal/molTDAsBogdanov, Peschke, et al., 1999gas phase
Quantity Value Units Method Reference Comment
Δr5.65kcal/molTDAsBogdanov, Peschke, et al., 1999gas phase

References

Bogdanov, Peschke, et al., 1999
Bogdanov, B.; Peschke, M.; Tonner, D.S.; Szulejko, J.E.; McMahon, T.B., Stepwise solvation of halides by alcohol molecules in the gas phase, Int. J. Mass Spectrom., 1999, 187, 707-725, https://doi.org/10.1016/S1387-3806(98)14180-5 . [all data]