(EtOH)2..Br anion

Reaction thermochemistry data

Data compiled by: John E. Bartmess

Individual Reactions

Bromine anion + 2Ethanol = C4H12BrO2-

By formula: Br- + 2C2H6O = C4H12BrO2-

Quantity Value Units Method Reference Comment
Δr11.50 ± 0.60kcal/molTDAsBogdanov, Peschke, et al., 1999gas phase
Quantity Value Units Method Reference Comment
Δr5.72kcal/molTDAsBogdanov, Peschke, et al., 1999gas phase

Ion clustering data

Data compiled by: John E. Bartmess

Clustering reactions

Bromine anion + 2Ethanol = C4H12BrO2-

By formula: Br- + 2C2H6O = C4H12BrO2-

Quantity Value Units Method Reference Comment
Δr11.50 ± 0.60kcal/molTDAsBogdanov, Peschke, et al., 1999gas phase
Quantity Value Units Method Reference Comment
Δr5.72kcal/molTDAsBogdanov, Peschke, et al., 1999gas phase

References

Bogdanov, Peschke, et al., 1999
Bogdanov, B.; Peschke, M.; Tonner, D.S.; Szulejko, J.E.; McMahon, T.B., Stepwise solvation of halides by alcohol molecules in the gas phase, Int. J. Mass Spectrom., 1999, 187, 707-725, https://doi.org/10.1016/S1387-3806(98)14180-5 . [all data]