(tBuOH)3..F anion

Reaction thermochemistry data

Data compiled by: John E. Bartmess

Individual Reactions

Fluorine anion + 32-Propanol, 2-methyl- = C12H30FO3-

By formula: F- + 3C4H10O = C12H30FO3-

Quantity Value Units Method Reference Comment
Δr76.6 ± 4.2kJ/molTDAsBogdanov, Peschke, et al., 1999gas phase
Quantity Value Units Method Reference Comment
Δr32.7kJ/molTDAsBogdanov, Peschke, et al., 1999gas phase

Ion clustering data

Data compiled by: John E. Bartmess

Clustering reactions

Fluorine anion + 32-Propanol, 2-methyl- = C12H30FO3-

By formula: F- + 3C4H10O = C12H30FO3-

Quantity Value Units Method Reference Comment
Δr76.6 ± 4.2kJ/molTDAsBogdanov, Peschke, et al., 1999gas phase
Quantity Value Units Method Reference Comment
Δr32.7kJ/molTDAsBogdanov, Peschke, et al., 1999gas phase

References

Bogdanov, Peschke, et al., 1999
Bogdanov, B.; Peschke, M.; Tonner, D.S.; Szulejko, J.E.; McMahon, T.B., Stepwise solvation of halides by alcohol molecules in the gas phase, Int. J. Mass Spectrom., 1999, 187, 707-725, https://doi.org/10.1016/S1387-3806(98)14180-5 . [all data]