(tBuOH)2..F anion

Reaction thermochemistry data

Data compiled by: John E. Bartmess

Individual Reactions

Fluorine anion + 22-Propanol, 2-methyl- = C8H20FO2-

By formula: F- + 2C4H10O = C8H20FO2-

Quantity Value Units Method Reference Comment
Δr22.00 ± 0.40kcal/molTDAsBogdanov, Peschke, et al., 1999gas phase
Quantity Value Units Method Reference Comment
Δr13.59kcal/molTDAsBogdanov, Peschke, et al., 1999gas phase

Ion clustering data

Data compiled by: John E. Bartmess

Clustering reactions

Fluorine anion + 22-Propanol, 2-methyl- = C8H20FO2-

By formula: F- + 2C4H10O = C8H20FO2-

Quantity Value Units Method Reference Comment
Δr22.00 ± 0.40kcal/molTDAsBogdanov, Peschke, et al., 1999gas phase
Quantity Value Units Method Reference Comment
Δr13.59kcal/molTDAsBogdanov, Peschke, et al., 1999gas phase

References

Bogdanov, Peschke, et al., 1999
Bogdanov, B.; Peschke, M.; Tonner, D.S.; Szulejko, J.E.; McMahon, T.B., Stepwise solvation of halides by alcohol molecules in the gas phase, Int. J. Mass Spectrom., 1999, 187, 707-725, https://doi.org/10.1016/S1387-3806(98)14180-5 . [all data]