(HCO2H)2..Br anion

Reaction thermochemistry data

Data compiled by: John E. Bartmess

Individual Reactions

CH2BrO2- + 2Formic acid = C2H4BrO4-

By formula: CH2BrO2- + 2CH2O2 = C2H4BrO4-

Quantity Value Units Method Reference Comment
Δr9.6 ± 1.7kcal/molCIDTWalker and Sunderlin, 1999gas phase

Ion clustering data

Data compiled by: John E. Bartmess

Clustering reactions

CH2BrO2- + 2Formic acid = C2H4BrO4-

By formula: CH2BrO2- + 2CH2O2 = C2H4BrO4-

Quantity Value Units Method Reference Comment
Δr9.6 ± 1.7kcal/molCIDTWalker and Sunderlin, 1999gas phase

References

Walker and Sunderlin, 1999
Walker, B.W.; Sunderlin, L.S., The thermochemistry of formic acid halide anion clusters, Int. J. Mass Spectrom., 1999, 184, 2-3, 183-189, https://doi.org/10.1016/S1387-3806(99)00008-1 . [all data]