CO..Cp(CO)Mn anion

Reaction thermochemistry data

Data compiled by: John E. Bartmess

Individual Reactions

C6H5MnO- + Carbon monoxide = C7H5MnO2-

By formula: C6H5MnO- + CO = C7H5MnO2-

Quantity Value Units Method Reference Comment
Δr7.80 ± 0.60kcal/molN/ASunderlin and Squires, 1999gas phase

References

Sunderlin and Squires, 1999
Sunderlin, L.S.; Squires, R.R., Bond strengths in cyclopentadienyl metal carbonyl anions, Int. J. Mass Spectrom., 1999, 183, 149-161, https://doi.org/10.1016/S1387-3806(98)14230-6 . [all data]