(H2O)..{nPrCO2H}..CO3 radical anion

Reaction thermochemistry data

Data compiled by: John E. Bartmess

Individual Reactions

CO3 + Water + Butanoic acid = C5H10O6-

By formula: CO3 + H2O + C4H8O2 = C5H10O6-

Quantity Value Units Method Reference Comment
Δr3.60 ± 0.20kcal/molIMREViidanoja, Reiner, et al., 2000gas phase

References

Viidanoja, Reiner, et al., 2000
Viidanoja, J.; Reiner, T.; Kiendler, A.; Grimm, F.; Arnold, F., Laboratory investigations of negative ion molecule reactions of propionic, butyric, glyoxylic, pyruvic, and pinonic acids, Int. J. Mass Spectrom., 2000, 194, 1, 53-68, https://doi.org/10.1016/S1387-3806(99)00172-4 . [all data]