(H2O)2..nPrCO2 anion

Ion clustering data

Data compiled by: John E. Bartmess

Clustering reactions

C4H9O3- + 3Water = C4H11O4-

By formula: C4H9O3- + 3H2O = C4H11O4-

Quantity Value Units Method Reference Comment
Δr27.6 ± 0.84kJ/molIMREViidanoja, Reiner, et al., 2000gas phase

C4H11O4- + 3Water = C4H13O5-

By formula: C4H11O4- + 3H2O = C4H13O5-

Quantity Value Units Method Reference Comment
Δr21.3 ± 0.84kJ/molIMREViidanoja, Reiner, et al., 2000gas phase

References

Viidanoja, Reiner, et al., 2000
Viidanoja, J.; Reiner, T.; Kiendler, A.; Grimm, F.; Arnold, F., Laboratory investigations of negative ion molecule reactions of propionic, butyric, glyoxylic, pyruvic, and pinonic acids, Int. J. Mass Spectrom., 2000, 194, 1, 53-68, https://doi.org/10.1016/S1387-3806(99)00172-4 . [all data]