nPrCO2H..NO3 anion

Reaction thermochemistry data

Data compiled by: John E. Bartmess

Individual Reactions

NO3 anion + Butanoic acid = C4H8NO5-

By formula: NO3- + C4H8O2 = C4H8NO5-

Quantity Value Units Method Reference Comment
Δr53.56 ± 0.84kJ/molIMREViidanoja, Reiner, et al., 2000gas phase

Ion clustering data

Data compiled by: John E. Bartmess

Clustering reactions

NO3 anion + Butanoic acid = C4H8NO5-

By formula: NO3- + C4H8O2 = C4H8NO5-

Quantity Value Units Method Reference Comment
Δr12.80 ± 0.20kcal/molIMREViidanoja, Reiner, et al., 2000gas phase

References

Viidanoja, Reiner, et al., 2000
Viidanoja, J.; Reiner, T.; Kiendler, A.; Grimm, F.; Arnold, F., Laboratory investigations of negative ion molecule reactions of propionic, butyric, glyoxylic, pyruvic, and pinonic acids, Int. J. Mass Spectrom., 2000, 194, 1, 53-68, https://doi.org/10.1016/S1387-3806(99)00172-4 . [all data]