pCN-C6F4C(CN)=C(OEt)O anion

Reaction thermochemistry data

Data compiled by: John E. Bartmess

Individual Reactions

C12H5F4N2O2- + Hydrogen cation = C12H6F4N2O2

By formula: C12H5F4N2O2- + H+ = C12H6F4N2O2

Quantity Value Units Method Reference Comment
Δr1283. ± 8.4kJ/molIMREKoppel, Koppel, et al., 2000gas phase

Gas phase ion energetics data

Data compiled by: John E. Bartmess

Protonation reactions

C12H5F4N2O2- + Hydrogen cation = C12H6F4N2O2

By formula: C12H5F4N2O2- + H+ = C12H6F4N2O2

Quantity Value Units Method Reference Comment
Δr1283. ± 8.4kJ/molIMREKoppel, Koppel, et al., 2000gas phase

References

Koppel, Koppel, et al., 2000
Koppel, I.A.; Koppel, J.; Pihl, V.; Leito, I.; Mishima, M.; Vlasov, V.M.; Yagupolskii, L.M.; Taft, R.W., Comparison of Bronsted acidities of neutral CH acids in gas phase and dimethyl sulfoxide, J. Chem. Soc. Perkin Trans., 2000, 2, 6, 1125-1133, https://doi.org/10.1039/b001792m . [all data]