p-aza-C5F4C(C6F5)CN anion

Reaction thermochemistry data

Data compiled by: John E. Bartmess

Individual Reactions

C13F9N2- + Hydrogen cation = C13HF9N2

By formula: C13F9N2- + H+ = C13HF9N2

Quantity Value Units Method Reference Comment
Δr1279. ± 8.4kJ/molIMREKoppel, Koppel, et al., 2000gas phase

Gas phase ion energetics data

Data compiled by: John E. Bartmess

Protonation reactions

C13F9N2- + Hydrogen cation = C13HF9N2

By formula: C13F9N2- + H+ = C13HF9N2

Quantity Value Units Method Reference Comment
Δr1279. ± 8.4kJ/molIMREKoppel, Koppel, et al., 2000gas phase

References

Koppel, Koppel, et al., 2000
Koppel, I.A.; Koppel, J.; Pihl, V.; Leito, I.; Mishima, M.; Vlasov, V.M.; Yagupolskii, L.M.; Taft, R.W., Comparison of Bronsted acidities of neutral CH acids in gas phase and dimethyl sulfoxide, J. Chem. Soc. Perkin Trans., 2000, 2, 6, 1125-1133, https://doi.org/10.1039/b001792m . [all data]