C6F5C(Ph)CN anion

Reaction thermochemistry data

Data compiled by: John E. Bartmess

Individual Reactions

C14H5F5N- + Hydrogen cation = C14H6F5N

By formula: C14H5F5N- + H+ = C14H6F5N

Quantity Value Units Method Reference Comment
Δr1362. ± 8.4kJ/molIMREKoppel, Koppel, et al., 2000gas phase

References

Koppel, Koppel, et al., 2000
Koppel, I.A.; Koppel, J.; Pihl, V.; Leito, I.; Mishima, M.; Vlasov, V.M.; Yagupolskii, L.M.; Taft, R.W., Comparison of Bronsted acidities of neutral CH acids in gas phase and dimethyl sulfoxide, J. Chem. Soc. Perkin Trans., 2000, 2, 6, 1125-1133, https://doi.org/10.1039/b001792m . [all data]