ZrF6 dianion

Gas phase ion energetics data

Data compiled by: John E. Bartmess

Electron affinity of neutral species

EAneutral (eV) Method Reference Comment
2.90 ± 0.20LPESWang and Wang, 2000Vertical Detachment Energy: 3.4±0.1 eV. Dianion lifetime ca. 4 sec wrt F- loss.

References

Wang and Wang, 2000
Wang, X.B.; Wang, L.S., Experimental observation of a very high second electron affinity for ZrF6 from photodetachment of gaseous ZrF62- doubly charged anions, J. Phys. Chem. A, 2000, 104, 19, 4429-4432, https://doi.org/10.1021/jp000362t . [all data]