Sn6Cl anion

Gas phase ion energetics data

Data compiled by: John E. Bartmess

Electron affinity of neutral species

EAneutral (eV) Method Reference Comment
2.92 ± 0.16LPESNegishi, Kawamata, et al., 2000EA is threshold energy, upper limit to true EA

References

Negishi, Kawamata, et al., 2000
Negishi, Y.; Kawamata, H.; Nakajima, A.; Kaya, K., Photoelectron spectroscopy of tin and lead cluster anions: application of halogen-doping method, J. Electron Spectros. Rel. Phenom., 2000, 106, 2-3, 117-125, https://doi.org/10.1016/S0368-2048(99)00070-5 . [all data]