CrC3 radical anion

Gas phase ion energetics data

Data compiled by: John E. Bartmess

Electron affinity of neutral species

EAneutral (eV) Method Reference Comment
1.474 ± 0.015LPESZhai, Wang, et al., 2004Vertical Detachment Energy = 1.474±0.015. Probably cyclic isomer.
1.500 ± 0.020LPESWang and Li, 2000

References

Zhai, Wang, et al., 2004
Zhai, H.J.; Wang, L.S.; Jena, P.; Gutsev, G.L.; Bauschlicher, C.W., Competition between linear and cyclic structures in monochromium carbide clusters CrCn- and CrCn (n=2-8): A photoelectron spe, J. Chem. Phys., 2004, 120, 19, 8996-9008, https://doi.org/10.1063/1.1701754 . [all data]

Wang and Li, 2000
Wang, L.S.; Li, X., Vibrationally resolved photoelectron spectroscopy of the first row transition metal and C-3 clusters: MC3- (M=Sc, V, Cr, Mn, Fe, Co, and Ni), J. Chem. Phys., 2000, 112, 8, 3602-3608, https://doi.org/10.1063/1.480513 . [all data]