2-aza-4-nitroanilide anion

Gas phase ion energetics data

Data compiled by: John E. Bartmess

Protonation reactions

C5H4N3O2- + Hydrogen cation = 2-Amino-5-nitropyridine

By formula: C5H4N3O2- + H+ = C5H5N3O2

Quantity Value Units Method Reference Comment
Δr1429. ± 12.kJ/molG+TSBreuker, Knochenmuss, et al., 1999gas phase; Acid: 2-amino-5-nitropyridine
Quantity Value Units Method Reference Comment
Δr1399. ± 11.kJ/molIMRBBreuker, Knochenmuss, et al., 1999gas phase; Acid: 2-amino-5-nitropyridine

References

Breuker, Knochenmuss, et al., 1999
Breuker, K.; Knochenmuss, R.; Zenobi, R., Gas-phase basicities of deprotonated matrix-assisted laser desorption/ionization matrix molecules, Int. J. Mass Spectrom., 1999, 184, 1, 25-38, https://doi.org/10.1016/S1387-3806(98)14200-8 . [all data]