PhSO3 anion

Reaction thermochemistry data

Data compiled by: John E. Bartmess

Individual Reactions

C6H5O3S- + Hydrogen cation = Benzenesulfonic acid

By formula: C6H5O3S- + H+ = C6H6O3S

Quantity Value Units Method Reference Comment
Δr1298. ± 28.kJ/molD-EAWang, Ferris, et al., 2000gas phase

Gas phase ion energetics data

Data compiled by: John E. Bartmess

Electron affinity of neutral species

EAneutral (eV) Method Reference Comment
5.00 ± 0.20LPESWang, Ferris, et al., 2000

Protonation reactions

C6H5O3S- + Hydrogen cation = Benzenesulfonic acid

By formula: C6H5O3S- + H+ = C6H6O3S

Quantity Value Units Method Reference Comment
Δr1298. ± 28.kJ/molD-EAWang, Ferris, et al., 2000gas phase

References

Wang, Ferris, et al., 2000
Wang, X.B.; Ferris, K.; Wang, L.S., Photodetachment of gaseous multiply charged anions, copper phthalocyanine tetrasulfonate tetraanion: Tuning molecular electronic energy levels by charging and negative electron binding, J. Phys. Chem. A, 2000, 104, 1, 25-33, https://doi.org/10.1021/jp9930090 . [all data]