Cu-Phthalocyanine-(SO3-)3(SO3Na)[-3]

Gas phase ion energetics data

Data compiled by: John E. Bartmess

Electron affinity of neutral species

EAneutral (eV) Method Reference Comment
1.00 ± 0.10LPESWang, Ferris, et al., 2000

References

Wang, Ferris, et al., 2000
Wang, X.B.; Ferris, K.; Wang, L.S., Photodetachment of gaseous multiply charged anions, copper phthalocyanine tetrasulfonate tetraanion: Tuning molecular electronic energy levels by charging and negative electron binding, J. Phys. Chem. A, 2000, 104, 1, 25-33, https://doi.org/10.1021/jp9930090 . [all data]