Cu-Phthalocyanine-(SO3-)4[-4]

Gas phase ion energetics data

Data compiled by: John E. Bartmess

Electron affinity of neutral species

EAneutral (eV) Method Reference Comment
-0.90 ± 0.10LPESWang, Ferris, et al., 2000tetra-anion unbound, but kinetically stable 0.1 sec. LPES: Coulombic barrier ca 3.5 eV

References

Wang, Ferris, et al., 2000
Wang, X.B.; Ferris, K.; Wang, L.S., Photodetachment of gaseous multiply charged anions, copper phthalocyanine tetrasulfonate tetraanion: Tuning molecular electronic energy levels by charging and negative electron binding, J. Phys. Chem. A, 2000, 104, 1, 25-33, https://doi.org/10.1021/jp9930090 . [all data]