CH2DCO anion

Gas phase ion energetics data

Data compiled by: John E. Bartmess

Electron affinity of neutral species

EAneutral (eV) Method Reference Comment
0.418 ± 0.038LPESNimlos, Soderquist, et al., 1989

References

Nimlos, Soderquist, et al., 1989
Nimlos, M.R.; Soderquist, J.A.; Ellison, G.B., Spectroscopy of CH3CO- and CH3CO, J. Am. Chem. Soc., 1989, 111, 20, 7675, https://doi.org/10.1021/ja00202a001 . [all data]