Ga11 anion

Gas phase ion energetics data

Data compiled by: John E. Bartmess

Electron affinity of neutral species

EAneutral (eV) Method Reference Comment
3.00 ± 0.10LPESCha, Ganteför, et al., 1994Stated electron affinity is the Vertical Detachment Energy

References

Cha, Ganteför, et al., 1994
Cha, C.-Y.; Ganteför, G.; Eberhardt, W., The Development of the 3p and 4p Valence Band of Small Aluminum and Gallium Clusters, J. Chem. Phys., 1994, 100, 2, 995, https://doi.org/10.1063/1.466582 . [all data]