Benzene, 1,2-dichloro-3-nitro- anion
- Formula: C6H3Cl2NO2-
- Molecular weight: 192.000

Gas phase thermochemistry data

Data compiled by: John E. Bartmess
Quantity | Value | Units | Method | Reference | Comment |
---|---|---|---|---|---|
ΔfH°gas | -25.7 ± 1.5 | kcal/mol | R-EA | Fukuda and McIver, 1985 | ΔGea(355 K) = -29.1 kcal/mol; ΔSea =-2.0, est. from data in Chowdhury, Heinis, et al., 1986 |

References

Fukuda and McIver, 1985
Fukuda, E.K.; McIver, R.T., Jr.,
Relative electron affinities of substituted benzophenones, nitrobenzenes, and quinones. [Anchored to EA(SO2) from 74CEL/BEN],
J. Am. Chem. Soc., 1985, 107, 2291. [all data]
Chowdhury, Heinis, et al., 1986
Chowdhury, S.; Heinis, T.; Grimsrud, E.P.; Kebarle, P.,
Entropy Changes and Electron Affinities from Gas-Phase Electron Transfer Equilibria: A- + B = A + B-,
J. Phys. Chem., 1986, 90, 12, 2747, https://doi.org/10.1021/j100403a037
. [all data]